【已解决】cygwin中用git去config配置用户名和邮箱出错:error: cannot run vi: No such file or directory

cygwin-git-config-error-cannot-run-vi_thumb.png

折腾: 【记录】将googlecode上面的crifanLib迁移到Github上 期间,出错: A …

Continue Reading →

【记录】恢复cygwin开发环境:右键打开cygwin+mintty为交互窗口+mintty支持log文件

under-HKEY_LOCAL_MACHINE-SOFTWARE-Classes-Directory-shell-new-entry_thumb.png

【背景】 之前由于: 【血的教训】修复移动硬盘上面的文件系统索引问题导致电脑上的硬盘的某个分区被格式 …

Continue Reading →

【已解决】cygwin下编译crosstool-ng在Installing C library的Building C library出错:rpc/types.h:73:18: error: expected ‘=’, ‘,’, ‘;’, ‘asm’ or ‘__attribute__’ before ‘u_char’

Installing-C-library-rpc-types.h-73-18-error-expected-asm-or-__attribute__-before-u_char_thumb.png

【问题】 折腾: 【已解决】cygwin下编译crosstool-ng在Building C lib …

Continue Reading →

【或许解决】cygwin中编译crosstool-ng在Installing C library headers & start files阶段出错:configure: error: support for the tls_model attribute is required

configure-error-support-for-the-tls_model-attribute-is-required_thumb.png

【问题】 解决: 【已解决】cygwin下编译crosstool-ng出错:make Error 2 …

Continue Reading →

【未解决】cygwin下编译crosstool-ng期间在配置eglibc时出现警告:checking add-on ports for preconfigure fragments… aarch64 alpha am33 arm arm/preconfigure: Did not find ARM architecture type; using default

【问题】 折腾: 【或许解决】cygwin中编译crosstool-ng在Installing C …

Continue Reading →

【已解决】docbook中用xsltproc处理xsl文件时用xsl:import引用本地css,js等文件时,必须加上file:///或file://的前缀才可以

【问题】 之前折腾docbook时,就遇到这个问题了。 现在又遇到了: docbook中用xsltp …

Continue Reading →

【已解决】在makefile中判断是cygwin还是Linux系统

【背景】 折腾: 【已解决】docbook中去make webhelp编译webhelp结果出错:E …

Continue Reading →

【记录】在Cygwin上用Buildroot为xscale建立交叉工具链

buildroot-can-got-into-menuconfig_thumb.png

【背景】 关于交叉工具链的事情,很久之前,就在Ubuntu上面折腾过Buildroot: build …

Continue Reading →

【已解决】cygwin下编译buildroot在alsa-lib时出错:libtool: Version mismatch error. This is libtool 2.4, but the definition of this LT_INIT comes from libtool 2.2.10.

alsa-lib-libtool-Version-mismatch-error-This-is-libtool-2.4-but-the_thumb.png

【问题】 折腾: 【记录】在Cygwin上用Buildroot为xscale建立交叉工具链 期间,在 …

Continue Reading →

【无需解决】cygwin下编译buildroot在uClibc的utils时出错:../utils/getconf.c:438:29: error: ‘_SC_CHARCLASS_NAME_MAX’ undeclared here (not in a function)

utils-getconf.c-error-_SC_CHARCLASS_NAME_MAX-undeclared-here-not-in-a-function_thumb.png

【问题】 折腾: 【记录】在Cygwin上用Buildroot为xscale建立交叉工具链 期间,编 …

Continue Reading →

无觅相关文章插件,快速提升流量